BDBM50497557 CHEMBL3359692
SMILES CC(C)C(=O)NC(C(=O)NO)c1ccc(cc1)-n1cccn1
InChI Key InChIKey=ZZLMORFDMAOBOY-UHFFFAOYSA-N
Data  2 KI
  Tab Delimited (TSV)   2D SDfile   Computed 3D by Vconf -m prep SDfile
Find this compound or compounds like it in BindingDB:
Activity Spreadsheet -- Enzyme Inhibition Constant Data from BindingDB
Found 1 hit for monomerid = 50497557
TargetM1 family aminopeptidase(Plasmodium falciparum (isolate FcB1 / Columbia))
Monash University
Curated by ChEMBL
LigandPNGBDBM50497557(CHEMBL3359692)
Affinity DataKi:  12nM. Assay description: Inhibition of Plasmodium falciparum M1 incubated for 10 mins before H-Leu-NHMec substrate addition by fluorescence assay
Ligand InfoPC cidPC sid
In DepthDetails ArticlePubMed